{"text_format":"1","workbook":"xlsx","n_sheets":5,"sheets":["data","proses","Nota","Kuitansi","label kirim"],"not_rendered":{"charts":0,"images":1,"macros":1,"external_links":0,"defined_names":0,"comments":0,"pivot_tables":0},"unopened":[],"bounds":{"document_bytes":16777216,"sheet_cells":100000,"rows_first":2000,"rows_last":500,"rows_between":2000,"halvings":0,"cell_chars":16384,"cell_head_chars":4096},"cells_cut":0,"cells_raw":0,"read":"whole","date_system":"1900"}

{"sheet":"data","index":0,"n_rows":526,"n_cols":12,"rows_kept":526,"cut":false,"hidden":false,"merged":[[1,6,1,10],[1,1,2,1]]}
["DATA ORDER"]
[null,"an Nota",null,null,null,null,"Label Pengiriman"]
["No",null,"Di","TANGGAL PEMBELIAN","NO. NOTA","Nama","baris 1","baris 2","baris 3","baris 4","Telepone","HARGA"]
[1,"SMA N 8 PADANG","KOTA PADANG","14 Oktober 2019","102.10.19","Agung Tirtayasa","SMA N 8 PADANG","Jalan Padang Indarung, ","Cengkeh Lubuk Begalung","KOTA PADANG , SUMBAR","Telp. 081265537968",337000]
[2,"Suciati Wulandani","BLORA","23 Januari 2020","111.01.20","Suciati Wulandani","Jl. Kapuas no 3a rt 05 rw 01","Kec. Blora, Kabupaten Blora","Jawa Tengah","KP : , 58217","Telp. 082227966386",341000]
[3,"ABROR","YOGYAKARTA","8 Agustus 2020125.08.20",null,"ABROR","Jl. Wiroyudo I No.77, Sorosutan"," UMBULHARJO,","KOTA YOGYAKARTA","DI YOGYAKARTA, KP, 55162","Telp. 089665548753",330000]
[4,"SMA N 9 SURAKARTA","SURAKARTA","21 Desember 2020","124/12/20","SAMIYANTO","SAMIYANTO","tarumanegara, Banyuanyar, banjarsari, Surakarta, 57137","SURAKARTA","JAWA TENGAH","Telp 0856424832992","300,000.00"]
[5]
[6]
[7]
[8]
[9]
[10]
[11]
[12]
[13]
[14]
[15]
[16]
[17]
[18]
[19]
[20]
[21]
[22]
[23]
[24]
[25]
[26]
[27]
[28]
[29]
[30]
[31]
[32]
[33]
[34]
[35]
[36]
[37]
[38]
[39]
[40]
[41]
[42]
[43]
[44]
[45]
[46]
[47]
[48]
[49]
[50]
[51]
[52]
[53]
[54]
[55]
[56]
[57]
[58]
[59]
[60]
[61]
[62]
[63]
[64]
[65]
[66]
[67]
[68]
[69]
[70]
[71]
[72]
[73]
[74]
[75]
[76]
[77]
[78]
[79]
[80]
[81]
[82]
[83]
[84]
[85]
[86]
[87]
[88]
[89]
[90]
[91]
[92]
[93]
[94]
[95]
[96]
[97]
[98]
[99]
[100]
[101]
[102]
[103]
[104]
[105]
[106]
[107]
[108]
[109]
[110]
[111]
[112]
[113]
[114]
[115]
[116]
[117]
[118]
[119]
[120]
[121]
[122]
[123]
[124]
[125]
[126]
[127]
[128]
[129]
[130]
[131]
[132]
[133]
[134]
[135]
[136]
[137]
[138]
[139]
[140]
[141]
[142]
[143]
[144]
[145]
[146]
[147]
[148]
[149]
[150]
[151]
[152]
[153]
[154]
[155]
[156]
[157]
[158]
[159]
[160]
[161]
[162]
[163]
[164]
[165]
[166]
[167]
[168]
[169]
[170]
[171]
[172]
[173]
[174]
[175]
[176]
[177]
[178]
[179]
[180]
[181]
[182]
[183]
[184]
[185]
[186]
[187]
[188]
[189]
[190]
[191]
[192]
[193]
[194]
[195]
[196]
[197]
[198]
[199]
[200]
[201]
[202]
[203]
[204]
[205]
[206]
[207]
[208]
[209]
[210]
[211]
[212]
[213]
[214]
[215]
[216]
[217]
[218]
[219]
[220]
[221]
[222]
[223]
[224]
[225]
[226]
[227]
[228]
[229]
[230]
[231]
[232]
[233]
[234]
[235]
[236]
[237]
[238]
[239]
[240]
[241]
[242]
[243]
[244]
[245]
[246]
[247]
[248]
[249]
[250]
[251]
[252]
[253]
[254]
[255]
[256]
[257]
[258]
[259]
[260]
[261]
[262]
[263]
[264]
[265]
[266]
[267]
[268]
[269]
[270]
[271]
[272]
[273]
[274]
[275]
[276]
[277]
[278]
[279]
[280]
[281]
[282]
[283]
[284]
[285]
[286]
[287]
[288]
[289]
[290]
[291]
[292]
[293]
[294]
[295]
[296]
[297]
[298]
[299]
[300]
[301]
[302]
[303]
[304]
[305]
[306]
[307]
[308]
[309]
[310]
[311]
[312]
[313]
[314]
[315]
[316]
[317]
[318]
[319]
[320]
[321]
[322]
[323]
[324]
[325]
[326]
[327]
[328]
[329]
[330]
[331]
[332]
[333]
[334]
[335]
[336]
[337]
[338]
[339]
[340]
[341]
[342]
[343]
[344]
[345]
[346]
[347]
[348]
[349]
[350]
[351]
[352]
[353]
[354]
[355]
[356]
[357]
[358]
[359]
[360]
[361]
[362]
[363]
[364]
[365]
[366]
[367]
[368]
[369]
[370]
[371]
[372]
[373]
[374]
[375]
[376]
[377]
[378]
[379]
[380]
[381]
[382]
[383]
[384]
[385]
[386]
[387]
[388]
[389]
[390]
[391]
[392]
[393]
[394]
[395]
[396]
[397]
{"$rows_left_out":127}
{"sheet":"proses","index":1,"n_rows":15,"n_cols":4,"rows_kept":15,"cut":false,"hidden":false,"merged":[[0,0,0,1]]}
["DATA ORDER",null,null,4]
[]
["SEKOLAH","Bp. NOOR CHOLIQ",null,"Bp. Irfan"]
["Di","KUDUS",null,{"$f":"VLOOKUP(D1,data!$A$4:$L$400,3)","v":"SURAKARTA"}]
["TANGGAL PEMBELIAN","08/05/2021",null,{"$f":"VLOOKUP(D1,data!$A$4:$L$400,4)","v":"21 Desember 2020"}]
["NO. NOTA","126/05/21",null,{"$f":"VLOOKUP(D1,data!$A$4:$L$400,5)","v":"124/12/20"}]
["HARGA",338900,null,{"$f":"VLOOKUP(D1,data!$A$4:$L$400,12)","v":"300,000.00"}]
[]
["Label Kirim"]
["Nama",{"$f":"D10","v":"SAMIYANTO"},null,{"$f":"VLOOKUP(D1,data!$A$4:$L$400,6)","v":"SAMIYANTO"}]
["baris 1",{"$f":"D11","v":"SAMIYANTO"},null,{"$f":"VLOOKUP(D1,data!$A$4:$L$400,7)","v":"SAMIYANTO"}]
["baris 2","tarumanegara, Banyuanyar, banjarsari, Surakarta, 57137",null,{"$f":"VLOOKUP(D1,data!$A$4:$L$400,8)","v":"tarumanegara, Banyuanyar, banjarsari, Surakarta, 57137"}]
["baris 3","SURAKARTA",null,{"$f":"VLOOKUP(D1,data!$A$4:$L$400,9)","v":"SURAKARTA"}]
["baris 4","JAWA TENGAH",null,{"$f":"VLOOKUP(D1,data!$A$4:$L$400,10)","v":"JAWA TENGAH"}]
["Telp","Telp 0856424832992",null,{"$f":"VLOOKUP(D1,data!$A$4:$L$400,11)","v":"Telp 0856424832992"}]

{"sheet":"Nota","index":2,"n_rows":31,"n_cols":7,"rows_kept":31,"cut":false,"hidden":false,"merged":[[8,5,8,7]]}
["Eka Software"]
["Hardware, Software dan Perbaikan Komputer "]
["RT 01 / RW 03 No. 70. Ds. Salamsari, Kec, Kedu, Kab. Temanggung"]
["Phone : 08122797075"]
[]
[null,null,"INVOICE"]
[]
[{"$f":"\"Untuk : \" &proses!B3","v":"Untuk : Bp. NOOR CHOLIQ"},null,null,"No. Invoice    :",null,{"$f":"Kuitansi!E4","v":"126/05/21"}]
[{"$f":"+\"            di \"&proses!B4","v":"            di KUDUS"},null,null,"Tanggal         :",null,{"$f":"proses!B5","v":"08/05/2021"}]
["No","Banyaknya","Uraian","Harga",null,"Jumlah"]
[]
[]
[1,"1 bh","Software Converter -","Rp.",{"$f":"proses!B7","v":338900},"Rp.",{"$f":"E13","v":338900}]
[null,null,"ASC to EXCEL"]
[]
[]
[]
[]
[]
[]
[]
[]
[]
[]
[]
[]
[null,{"$f":"Kuitansi!H14","v":"Temanggung, 08/05/2021"},null,"JUMLAH",null,"Rp.",{"$f":"E13","v":338900}]
[]
[]
[]
[null,"Eka Waluya"]

{"sheet":"Kuitansi","index":3,"n_rows":20,"n_cols":10,"rows_kept":20,"cut":false,"hidden":false,"merged":[]}
[]
[null,"K U I T A N S I"]
[]
[null,"Nomor",null,":",{"$f":"proses!B6","v":"126/05/21"}]
[]
[null,"Telah terima dari",null,":",{"$f":"proses!B3","v":"Bp. NOOR CHOLIQ"}]
[]
[null,"Uang Sebesar",null,":",{"$f":"\"  \"&Terbilang(F12)&\" \" &\"Rupiah\"","v":"  tiga ratus tiga puluh delapan ribu sembilan ratus  Rupiah"}]
[]
[null,"Untuk Pembayaran",null,":","Software Converter ASC to Excel"]
[]
[null,"Terbilang",null,":   Rp.  ",null,{"$f":"Nota!E13","v":338900}]
[]
[null,"Setuju dibayar",null,null,null,{"$f":"\"Lunas dibayar, \"&proses!B5","v":"Lunas dibayar, 08/05/2021"},null,{"$f":"\"Temanggung, \"&proses!B5","v":"Temanggung, 08/05/2021"}]
[null,{"$f":"\"Kepala \"&proses!B3","v":"Kepala Bp. NOOR CHOLIQ"},null,null,null,{"$f":"\"Bendahara \"&proses!B3","v":"Bendahara Bp. NOOR CHOLIQ"}]
[]
[]
[null,null,null,null,null,null,null,null,"Nama  : Eka Waluya"]
[null,null,null,null,null,null,null,null,"Alamat : Salamsari, Kedu"]
[null,null,null,null,null,"……………………………..",null,null,null,"Temanggung"]

{"sheet":"label kirim","index":4,"n_rows":7,"n_cols":12,"rows_kept":7,"cut":false,"hidden":false,"merged":[]}
[null,"Kepada Yth."]
[null,"Suwarto, ST"]
[null,"SMK Negeri 2 Purwodadi",null,null,null,null,null,null,null,null,null,"Eka Waluya"]
[null,"Jl. MH. Thamrin No 50 Danyang",null,null,null,null,null,null,null,null,null,"Ds. Salamsari, Kedu"]
[null,"KAB. GROBOGAN, PURWODADI",null,null,null,null,null,null,null,null,null,"Kab. Temanggung 56252"]
[null,"JAWA TENGAH, ID, 58113",null,null,null,null,null,null,null,null,null,"Jawa Tengah"]
[null,"Telp 085328377284",null,null,null,null,null,null,null,null,null,"Telp. 08122797075"]